{"text_format":"1","workbook":"xlsx","n_sheets":12,"sheets":["RH1","Risk Evreni Çalışması","Template vs. Examples","REF - Instructions","GİRİŞ - Kategoriler&Dereceleme","Risk - Belirleme","riskler","Risk - Analizi","Risk - Yönetimi","ÇIKTI - Risk Kaydı","REF - Glossary","REF - FAQs"],"not_rendered":{"charts":0,"images":3,"macros":1,"external_links":0,"defined_names":21,"comments":0,"pivot_tables":0},"unopened":[],"bounds":{"document_bytes":16777216,"sheet_cells":100000,"rows_first":2000,"rows_last":500,"rows_between":2000,"halvings":0,"cell_chars":16384,"cell_head_chars":4096},"cells_cut":0,"cells_raw":0,"read":"whole","date_system":"1900"}

{"sheet":"RH1","index":0,"n_rows":12,"n_cols":25,"rows_kept":12,"cut":false,"hidden":true,"merged":[[10,1,11,2],[10,14,11,15],[11,3,11,7],[11,16,11,20],[0,0,0,25],[2,1,2,7],[2,14,2,20],[3,1,3,7],[3,14,3,20],[5,1,9,1],[5,9,5,11],[5,14,9,14],[5,22,5,24]]}
["RİSK HARİTASI"]
[null,"SAĞLIK KÜLTÜR VE SPOR DAİRE BAŞKANLIĞI"]
[null,"Kontrol Önlemleri Öncesi Risk Haritası",null,null,null,null,null,null,null,null,null,null,null,null,"Kontrol Önlemleri Sonrası Risk Haritası"]
[null,"Her etki / olasılık senaryosu başına risk",null,null,null,null,null,null,null,null,null,null,null,null,"Her etki / olasılık senaryosu başına risk"]
[]
[null,"Etki","Çok Yüksek",{"$f":"IF('Risk - Analizi'!AK100=0,\"\",'Risk - Analizi'!AK100)","v":""},{"$f":"IF('Risk - Analizi'!AL100=0,\"\",'Risk - Analizi'!AL100)","v":""},{"$f":"IF('Risk - Analizi'!AM100=0,\"\",'Risk - Analizi'!AM100)","v":""},{"$f":"IF('Risk - Analizi'!AN100=0,\"\",'Risk - Analizi'!AN100)","v":""},{"$f":"IF('Risk - Analizi'!AO100=0,\"\",'Risk - Analizi'!AO100)","v":""},null,"Toplamlar",null,null,null,null,"Etki","Çok Yüksek",{"$f":"IF('Risk - Yönetimi'!AQ100=0,\"\",'Risk - Yönetimi'!AQ100)","v":""},{"$f":"IF('Risk - Yönetimi'!AR100=0,\"\",'Risk - Yönetimi'!AR100)","v":""},{"$f":"IF('Risk - Yönetimi'!AS100=0,\"\",'Risk - Yönetimi'!AS100)","v":""},{"$f":"IF('Risk - Yönetimi'!AT100=0,\"\",'Risk - Yönetimi'!AT100)","v":""},{"$f":"IF('Risk - Yönetimi'!AU100=0,\"\",'Risk - Yönetimi'!AU100)","v":""},null,"Toplamlar"]
[null,null,"Yüksek",{"$f":"IF('Risk - Analizi'!AF100=0,\"\",'Risk - Analizi'!AF100)","v":""},{"$f":"IF('Risk - Analizi'!AG100=0,\"\",'Risk - Analizi'!AG100)","v":""},{"$f":"IF('Risk - Analizi'!AH100=0,\"\",'Risk - Analizi'!AH100)","v":""},{"$f":"IF('Risk - Analizi'!AI100=0,\"\",'Risk - Analizi'!AI100)","v":""},{"$f":"IF('Risk - Analizi'!AJ100=0,\"\",'Risk - Analizi'!AJ100)","v":""},null,"Çok Yüksek Riskler",{"$f":"IF(SUM($L$7:$L$10)=0,\"\",L7/SUM($L$7:$L$10))","v":""},{"$f":"SUM(G6:H7)","v":0},null,null,null,"Yüksek",{"$f":"IF('Risk - Yönetimi'!AL100=0,\"\",'Risk - Yönetimi'!AL100)","v":""},{"$f":"IF('Risk - Yönetimi'!AM100=0,\"\",'Risk - Yönetimi'!AM100)","v":""},{"$f":"IF('Risk - Yönetimi'!AN100=0,\"\",'Risk - Yönetimi'!AN100)","v":""},{"$f":"IF('Risk - Yönetimi'!AO100=0,\"\",'Risk - Yönetimi'!AO100)","v":""},{"$f":"IF('Risk - Yönetimi'!AP100=0,\"\",'Risk - Yönetimi'!AP100)","v":""},null,"Çok Yüksek Riskler",{"$f":"IF(SUM($L$7:$L$10)=0,\"\",Y7/SUM($L$7:$L$10))","v":""},{"$f":"SUM(T6:U7)","v":0}]
[null,null,"Orta",{"$f":"IF('Risk - Analizi'!AA100=0,\"\",'Risk - Analizi'!AA100)","v":""},{"$f":"IF('Risk - Analizi'!AB100=0,\"\",'Risk - Analizi'!AB100)","v":""},{"$f":"IF('Risk - Analizi'!AC100=0,\"\",'Risk - Analizi'!AC100)","v":""},{"$f":"IF('Risk - Analizi'!AD100=0,\"\",'Risk - Analizi'!AD100)","v":""},{"$f":"IF('Risk - Analizi'!AE100=0,\"\",'Risk - Analizi'!AE100)","v":""},null,"Yüksek Riskler",{"$f":"IF(SUM($L$7:$L$10)=0,\"\",L8/SUM($L$7:$L$10))","v":""},{"$f":"SUM(G8:H8,F6:F7)","v":0},null,null,null,"Orta",{"$f":"IF('Risk - Yönetimi'!AG100=0,\"\",'Risk - Yönetimi'!AG100)","v":2},{"$f":"IF('Risk - Yönetimi'!AH100=0,\"\",'Risk - Yönetimi'!AH100)","v":""},{"$f":"IF('Risk - Yönetimi'!AI100=0,\"\",'Risk - Yönetimi'!AI100)","v":""},{"$f":"IF('Risk - Yönetimi'!AJ100=0,\"\",'Risk - Yönetimi'!AJ100)","v":""},{"$f":"IF('Risk - Yönetimi'!AK100=0,\"\",'Risk - Yönetimi'!AK100)","v":""},null,"Yüksek Riskler",{"$f":"IF(SUM($L$7:$L$10)=0,\"\",Y8/SUM($L$7:$L$10))","v":""},{"$f":"SUM(T8:U8,S6:S7)","v":0}]
[null,null,"Düşük",{"$f":"IF('Risk - Analizi'!V100=0,\"\",'Risk - Analizi'!V100)","v":""},{"$f":"IF('Risk - Analizi'!W100=0,\"\",'Risk - Analizi'!W100)","v":""},{"$f":"IF('Risk - Analizi'!X100=0,\"\",'Risk - Analizi'!X100)","v":""},{"$f":"IF('Risk - Analizi'!Y100=0,\"\",'Risk - Analizi'!Y100)","v":""},{"$f":"IF('Risk - Analizi'!Z100=0,\"\",'Risk - Analizi'!Z100)","v":""},null,"Orta Riskler",{"$f":"IF(SUM($L$7:$L$10)=0,\"\",L9/SUM($L$7:$L$10))","v":""},{"$f":"SUM(H9:H10,F9:G9,E8:F8,E6:E7,D6)","v":0},null,null,null,"Düşük",{"$f":"IF('Risk - Yönetimi'!AB100=0,\"\",'Risk - Yönetimi'!AB100)","v":2},{"$f":"IF('Risk - Yönetimi'!AC100=0,\"\",'Risk - Yönetimi'!AC100)","v":10},{"$f":"IF('Risk - Yönetimi'!AD100=0,\"\",'Risk - Yönetimi'!AD100)","v":""},{"$f":"IF('Risk - Yönetimi'!AE100=0,\"\",'Risk - Yönetimi'!AE100)","v":""},{"$f":"IF('Risk - Yönetimi'!AF100=0,\"\",'Risk - Yönetimi'!AF100)","v":""},null,"Orta Riskler",{"$f":"IF(SUM($L$7:$L$10)=0,\"\",Y9/SUM($L$7:$L$10))","v":""},{"$f":"SUM(U9:U10,S9:T9,R8:S8,R6:R7,Q6)","v":0}]
[null,null,"Çok Düşük",{"$f":"IF('Risk - Analizi'!Q100=0,\"\",'Risk - Analizi'!Q100)","v":""},{"$f":"IF('Risk - Analizi'!R100=0,\"\",'Risk - Analizi'!R100)","v":""},{"$f":"IF('Risk - Analizi'!S100=0,\"\",'Risk - Analizi'!S100)","v":""},{"$f":"IF('Risk - Analizi'!T100=0,\"\",'Risk - Analizi'!T100)","v":""},{"$f":"IF('Risk - Analizi'!U100=0,\"\",'Risk - Analizi'!U100)","v":""},null,"Düşük Riskler",{"$f":"IF(SUM($L$7:$L$10)=0,\"\",L10/SUM($L$7:$L$10))","v":""},{"$f":"SUM(D10:G10,D7:D9,E9)","v":0},null,null,null,"Çok Düşük",{"$f":"IF('Risk - Yönetimi'!W100=0,\"\",'Risk - Yönetimi'!W100)","v":1},{"$f":"IF('Risk - Yönetimi'!X100=0,\"\",'Risk - Yönetimi'!X100)","v":""},{"$f":"IF('Risk - Yönetimi'!Y100=0,\"\",'Risk - Yönetimi'!Y100)","v":""},{"$f":"IF('Risk - Yönetimi'!Z100=0,\"\",'Risk - Yönetimi'!Z100)","v":""},{"$f":"IF('Risk - Yönetimi'!AA100=0,\"\",'Risk - Yönetimi'!AA100)","v":""},null,"Düşük Riskler",{"$f":"IF(SUM($L$7:$L$10)=0,\"\",Y10/SUM($L$7:$L$10))","v":""},{"$f":"SUM(Q10:T10,Q7:Q9,R9)","v":15}]
{"$rows_left_out":3}
{"sheet":"Risk Evreni Çalışması","index":1,"n_rows":6,"n_cols":3,"rows_kept":6,"cut":false,"hidden":false,"merged":[[6,2,6,5],[0,0,0,7],[2,1,2,6],[3,2,3,5],[4,2,4,5]]}
["RİSK EVRENİNİN BELİRLENMESİ ÇALIŞTAYI RİSK DEĞERLENDİRME FORMU"]
[]
[]
[null,null,"DÜZCE ÜNİVERSİTESİ"]
[]
[null,null,"BİRİM:"]

{"sheet":"Template vs. Examples","index":2,"n_rows":4,"n_cols":2,"rows_kept":4,"cut":false,"hidden":true,"merged":[[0,0,0,7],[3,1,3,6]]}
["TEMPLATE VS. EXAMPLES"]
[]
[]
[null,"This is a blank, editable version (template) of the risk register tool. Before entering risks into the tool, the agency should: a) determine whether or not this will be an enterprise-level risk register or a program-level risk register and b) populate the \"Categories & Rating\" sheet. The user should refer to the example \"Enterprise\" and/or \"Program\" risk register(s) to see how to properly populate the \"Categories & Rating\" sheet; further, the agency is free to use the verbiage from the example(s) for its risk register. Once the \"Categories & Rating\" sheet is populated, the agency can move forward in using the risk register by populating the remaining input sheets.\n"]

{"sheet":"REF - Instructions","index":3,"n_rows":32,"n_cols":4,"rows_kept":32,"cut":false,"hidden":true,"merged":[[11,1,11,6],[0,0,0,7],[3,1,3,6],[4,1,4,6],[7,1,7,6],[8,1,8,6],[12,1,12,6],[15,1,15,6],[16,1,16,6],[18,3,18,5],[19,3,19,5],[30,1,30,6],[31,1,31,6],[26,3,26,5],[17,3,17,5],[20,3,20,5],[21,3,21,5],[22,3,22,5],[23,3,23,5],[24,3,24,5],[25,3,25,5]]}
["INSTRUCTIONS"]
[]
[]
[null,"Overview"]
[null,"The risk register is a spreadsheet-based tool used for identifying, analyzing, and monitoring enterprise or program-level risk. The tool provides a complete risk register that can be modified for user-added preferences or additional information. \n\nThe risk register can be used to support a risk management process consistent with industry best practices, the ISO 31000 standard, and the NCHRP 08-93 Enterprise Risk Management Guide. The tool mirrors the core risk management steps, including risk identification, risk analysis, risk evaluation, and risk management/treatment. For this tool, risk evaluation is included as part of risk analysis. \n\nThis version of the risk register is designed for threats and not for opportunities. The tool can be adapted by the user to be used as a register for opportunities. "]
[]
[]
[null,"Enterprise vs. Program"]
[null,"The risk register tool can be used for either enterprise or program risk management. When completing the first input sheet, \"Categories & Rating\", the user should determine whether this tool will be used for enterprise or program-level risk management. The tool cannot be used for both enterprise and program risk management at the same time. The user should create a copy of the template and designate one copy as enterprise and one copy as program. "]
[]
{"$rows_left_out":23}
{"sheet":"GİRİŞ - Kategoriler&Dereceleme","index":4,"n_rows":12,"n_cols":18,"rows_kept":12,"cut":false,"hidden":true,"merged":[[0,0,0,18],[7,10,8,10],[7,11,8,11],[7,12,8,12],[7,13,8,13],[7,14,8,14],[7,1,8,1],[7,2,8,2],[7,4,8,4],[7,3,8,3],[7,9,8,9],[7,5,8,5],[2,1,4,1],[1,1,1,9],[2,0,11,0],[1,10,1,14],[5,1,6,1],[5,2,6,2],[5,3,6,3],[5,4,6,4],[5,5,6,5],[5,14,6,14],[5,9,6,9],[5,10,6,10],[5,11,6,11],[5,12,6,12],[5,13,6,13],[5,6,6,6],[5,7,6,7],[5,8,6,8],[7,8,8,8],[7,7,8,7],[7,6,8,6]]}
["RİSK KATEGORİLERİ & ORANLAMA MATRİSİ"]
[null,"Risk Kategorileri // Etki Alanları",null,null,null,null,null,null,null,null,"Olasılık Aralıkları ve Risk Derecelendirmeleri (Düşük, Orta, Yüksek, Çok Yüksek)"]
["Impact Levels",null,null,null,null,null,null,null,null,null,"Çok Düşük","Düşük","Orta","Yüksek","Çok Yüksek"]
[null,null,"Stratejik","Operasyonel","İtibar","Finansal","Yasal/Uygunluk","Bilgi Sistemleri","Raporlamalar","Sağlık ve güvenlik","Olasılığın Niteliksel Açıklaması\n(Kullanıcı Girişli)","Olasılığın Niteliksel Açıklaması\n(Kullanıcı Girişli)","Olasılığın Niteliksel Açıklaması\n(Kullanıcı Girişli)","Olasılığın Niteliksel Açıklaması\n(Kullanıcı Girişli)","Olasılığın Niteliksel Açıklaması\n(Kullanıcı Girişli)"]
[null,null,null,null,null,null,null,null,null,null,"Olasılığın Niceliksel Açıklaması\n(Kullanıcı Girişli)","Olasılığın Niceliksel Açıklaması\n(Kullanıcı Girişli)","Olasılığın Niceliksel Açıklaması\n(Kullanıcı Girişli)","Olasılığın Niceliksel Açıklaması\n(Kullanıcı Girişli)","Olasılığın Niceliksel Açıklaması\n(Kullanıcı Girişli)",null,"Anahtar"]
[null,"Çok Yüksek","Etkinin Tanımı\n(Kullanıcı Girişli)","Etkinin Tanımı\n(Kullanıcı Girişli)","Etkinin Tanımı\n(Kullanıcı Girişli)","Etkinin Tanımı\n(Kullanıcı Girişli)","Etkinin Tanımı\n(Kullanıcı Girişli)","Etkinin Tanımı\n(Kullanıcı Girişli)","Etkinin Tanımı\n(Kullanıcı Girişli)","Etkinin Tanımı\n(Kullanıcı Girişli)","Orta","Orta","Yüksek","Çok Yüksek","Çok Yüksek",null,"Çok Yüksek","[Üst Yönetimin ve yönetimin müdahalesini gerektirir; riski ele almak için yeni kurumsal veya program seviyesi kontrollerini uygulamak için derhal harekete geçilmesini gerektirir.]"]
[null,null,null,null,null,null,null,null,null,null,null,null,null,null,null,null,"Yüksek","[Örgütün görevini veya stratejik planını yerine getirme yeteneğini etkiler - mevcut kontroller etkili olabilir ancak yönetim ve üst yönetim seviyesinde yönetilecek ilave eylem ve / veya kontroller gerektirebilir.]"]
[null,"Yüksek","Etkinin Tanımı\n(Kullanıcı Girişli)","Etkinin Tanımı\n(Kullanıcı Girişli)","Etkinin Tanımı\n(Kullanıcı Girişli)","Etkinin Tanımı\n(Kullanıcı Girişli)","Etkinin Tanımı\n(Kullanıcı Girişli)","Etkinin Tanımı\n(Kullanıcı Girişli)","Etkinin Tanımı\n(Kullanıcı Girişli)","Etkinin Tanımı\n(Kullanıcı Girişli)","Düşük","Orta","Yüksek","Çok Yüksek","Çok Yüksek",null,"Orta","[Çok yüksek örgüt işlevinin etkilerinin tamamlanması - mevcut denetimlerin etkili olması ve olası ek işlemlerin uygulanması gerekebilir.]"]
[null,null,null,null,null,null,null,null,null,null,null,null,null,null,null,null,"Düşük","[Mevcut uygulamalar ve prosedürler ile yönetilir - etkiler, etkililik açısından izlenecek rutin işlemlerle ele alınır.]"]
[null,"Orta","Etkinin Tanımı\n(Kullanıcı Girişli)","Etkinin Tanımı\n(Kullanıcı Girişli)","Etkinin Tanımı\n(Kullanıcı Girişli)","Etkinin Tanımı\n(Kullanıcı Girişli)","Etkinin Tanımı\n(Kullanıcı Girişli)","Etkinin Tanımı\n(Kullanıcı Girişli)","Etkinin Tanımı\n(Kullanıcı Girişli)","Etkinin Tanımı\n(Kullanıcı Girişli)","Düşük","Orta","Orta","Yüksek","Yüksek"]
{"$rows_left_out":3}
{"sheet":"Risk - Belirleme","index":5,"n_rows":31,"n_cols":5,"rows_kept":31,"cut":false,"hidden":false,"merged":[[0,0,0,4]]}
["RİSK BELİRLEME"]
["RİSK NO","Date Identified","Anahtar Risk Göstergesi ","Detaylı Risk Açıklaması","Risk Kategorisi"]
["Manuel","Manual\n(MM/DD/YY)","Manuel","Manuel","Açılır Liste"]
[]
[null,null,null,null,{"$f":"'GİRİŞ - Kategoriler&Dereceleme'!C4","v":"Stratejik"}]
[" ",null,null,null,{"$f":"'GİRİŞ - Kategoriler&Dereceleme'!D4","v":"Operasyonel"}]
[null,null,null,null,{"$f":"'GİRİŞ - Kategoriler&Dereceleme'!E4","v":"İtibar"}]
[null,null,null,null,{"$f":"'GİRİŞ - Kategoriler&Dereceleme'!F4","v":"Finansal"}]
[null,null,null,null,{"$f":"'GİRİŞ - Kategoriler&Dereceleme'!G4","v":"Yasal/Uygunluk"}]
[null,null,null,null,{"$f":"'GİRİŞ - Kategoriler&Dereceleme'!H4","v":"Bilgi Sistemleri"}]
{"$rows_left_out":22}
{"sheet":"riskler","index":6,"n_rows":61,"n_cols":4,"rows_kept":61,"cut":false,"hidden":true,"merged":[]}
[]
[null,"RİSKLER","RİSK KATEGORİSİ","KONTROL FAALİYET"]
[null,"Kayıt hakkı olmayan öğrencilerin kaydedilmesi","Operasyonel ve Yasal Risk","Öğrenci otomasyon işlemlerinde şifre güvenliğine önem verilmesi ve görevler ayrılığı ilkesine uygun olarak işlem yapılması tavsiye edilmektedir"]
[null,"Öğrenci kayıtlarının hatalı olması","Operasyonel ve Yasal Risk","Öğrenci otomasyon işlemlerinde şifre güvenliğine önem verilmesi ve görevler ayrılığı ilkesine uygun olarak işlem yapılması tavsiye edilmektedir"]
[null,"Öğrenci notlarının yetkisiz veya onaysız değiştirilmesi","Operasyonel ve Yasal Risk","Öğrenci otomasyon işlemlerinde şifre güvenliğine önem verilmesi ve görevler ayrılığı ilkesine uygun olarak işlem yapılması tavsiye edilmektedir"]
[null,"Öğrenci memnuniyetsizliği oluşması","Operasyonel ve Yasal Risk","Öğrenci memnuniyet anketi düzenlenerek geri bildirimlerin düzenli olarak takip edilmesi\nönerilmektedir."]
[null,"İş sürekliliğinin sağlanamaması","Operasyonel Risk","Görev tanımı ve görevler ayrılığı ilkesine uygun işlem yapılması tavsiye edilmektedir."]
[null,"Şifrelerin çalışanlar arasında paylaşılması","Operasyonel, Finansal ve Yasal Risk","Öğrenci otomasyon işlemlerinde şifre güvenliğine önem verilmesi ve görevler ayrılığı ilkesine uygun olarak işlem yapılması tavsiye edilmektedir"]
[null,"Verilerin geriye dönük olarak uygun olmayan şekilde değiştirilmesi","Operasyonel, Finansal ve Yasal Risk","Öğrenci otomasyon işlemlerinde şifre güvenliğine önem verilmesi ve görevler ayrılığı ilkesine uygun olarak işlem yapılması tavsiye edilmektedir"]
[null,"Banka mutabakatlarının düzenli yapılmaması","Operasyonel ve Finansal Risk","Banka mutabakatlarına özen gösterilmesi ve zamanında yapılarak nakit yönetimine önem verilmesi gerekmektedir."]
{"$rows_left_out":52}
{"sheet":"Risk - Analizi","index":7,"n_rows":100,"n_cols":41,"rows_kept":100,"cut":false,"hidden":false,"merged":[[0,0,0,8],[5,16,9,16],[11,18,11,22],[1,16,1,40],[5,29,5,32]]}
["RİSK ANALİZİ"]
["RİSK NO","Detaylı Risk Açıklaması","Risk Kategorisi","Impact Score","Etki","Likelihood Score","Olasılık","Risk Score","Risk Oranı",null,null,null,null,null,null,null,"Risk Rating & Heat Map Calculator - DO NOT EDIT"]
["Otomatik","Otomatik","Otomatik","Hidden Col.","Açılır Liste","Hidden Col.","Açılır Liste","Hidden Col.","Otomatik"]
[]
[]
[" ",null,null,null,null,null,null,null,null,null,null,null,null,null,null,null,"Impact",5,"U","V","W","X","Y",null,null,null,null,null,null,"Score"]
[null,null,null,5,"Çok Yüksek",5,"Çok Yüksek",null,null,null,null,null,null,null,null,null,null,4,"P","Q","R","S","T",null,null,null,null,null,null,1,"-",4,"Düşük"]
[null,null,null,4,"Yüksek",4,"Yüksek",null,null,null,null,null,null,null,null,null,null,3,"K","L","M","N","O",null,null,null,null,null,null,5,"-",10,"Orta"]
[null,null,null,3,"Orta",3,"Orta",null,null,null,null,null,null,null,null,null,null,2,"F","G","H","I","J",null,null,null,null,null,null,12,"-",15,"Yüksek"]
[null,null,null,2,"Düşük",2,"Düşük",null,null,null,null,null,null,null,null,null,null,1,"A","B","C","D","E",null,null,null,null,null,null,16,"-",25,"Çok Yüksek"]
{"$rows_left_out":91}
{"sheet":"Risk - Yönetimi","index":8,"n_rows":100,"n_cols":47,"rows_kept":100,"cut":false,"hidden":false,"merged":[[0,0,0,14],[1,22,1,46],[5,22,9,22],[5,35,5,38],[11,24,11,28],[1,0,2,0],[1,1,2,1],[1,2,2,2],[1,3,2,3],[1,4,2,4],[1,5,2,5],[1,9,1,14],[1,6,2,6],[1,7,2,7],[1,8,2,8]]}
["RİSK YÖNETİMİ"]
["RİSK NO","Detaylı Risk Açıklaması","Risk Kategorisi","Risk Yönetimi Stratejisi","Kontrol Faaliyeti / Strateji Açıklaması","Risk Sorumlusu","Riskin Ait Olduğu Süreç / Faaliyet","Riskin Ait Olduğu Alt Süreç / Alt Faaliyet","Riske ait Mevzuat ve/veya Politika Belgesi","Kontrol Önlemleri Sonrası Risk Değerlendirmesi"]
[null,null,null,null,null,null,null,null,null,"Impact Score","Etki","Likelihood Score","Olasılık","Risk Score","Risk Oranı"]
["Otomatik","Otomatik","Otomatik","Açılır Liste","Manuel","Manuel","Manuel","Manuel","Manuel","Hidden Col.","Açılır Liste","Hidden Col.","Açılır Liste","Hidden Col.","Otomatik"]
[]
[" ",null,null,null,null,null,null,null,null,null,null,null,null,null,null,null,null,null,null,null,null,null,"Impact",5,"U","V","W","X","Y",null,null,null,null,null,null,"Score"]
[null,null,null,"Kabul Et",null,null,null,"Aktif",null,5,"Çok Yüksek",5,"Çok Yüksek",null,null,null,null,null,null,null,null,null,null,4,"P","Q","R","S","T",null,null,null,null,null,null,1,"-",4,"Düşük"]
[null,null,null,"Kontrol Geliştir",null,null,null,"Pasif",null,4,"Yüksek",4,"Yüksek",null,null,null,null,null,null,null,null,null,null,3,"K","L","M","N","O",null,null,null,null,null,null,5,"-",10,"Orta"]
[null,null,null,"Transfer Et",null,null,null,null,null,3,"Orta",3,"Orta",null,null,null,null,null,null,null,null,null,null,2,"F","G","H","I","J",null,null,null,null,null,null,12,"-",15,"Yüksek"]
[null,null,null,"Kaçın",null,null,null,null,null,2,"Düşük",2,"Düşük",null,null,null,null,null,null,null,null,null,null,1,"A","B","C","D","E",null,null,null,null,null,null,16,"-",25,"Çok Yüksek"]
{"$rows_left_out":91}
{"sheet":"ÇIKTI - Risk Kaydı","index":9,"n_rows":99,"n_cols":13,"rows_kept":99,"cut":false,"hidden":true,"merged":[[2,11,3,11],[0,0,0,12],[2,0,3,0],[2,1,3,1],[2,2,3,2],[2,6,3,6],[2,7,3,7],[2,8,3,8],[2,3,3,3],[2,4,3,4],[1,0,1,4],[2,5,3,5],[1,6,1,12],[2,12,3,12],[2,9,3,9],[2,10,3,10]]}
["RİSK KAYDI"]
["RİSK BELİRLEME",null,null,null,null,"RİSK ANALİZİ ","RİSK YÖNETİMİ "]
["RİSK NO","Date Identified","Anahtar Risk Göstergesi ","Detaylı Risk Açıklaması","Risk Kategorisi","Kontrol Önlemleri Öncesi Risk Değerlendirmesi","Risk Yönetimi Stratejisi","Kontrol Faaliyeti / Strateji Açıklaması","Risk Sorumlusu","Riskin Ait Olduğu Süreç / Faaliyet","Etki","Olasılık","Kontrol Önlemleri Sonrası Risk Değerlendirmesi"]
[]
[]
[" "]
[]
[]
[]
[]
{"$rows_left_out":90}
{"sheet":"REF - Glossary","index":10,"n_rows":31,"n_cols":4,"rows_kept":31,"cut":false,"hidden":true,"merged":[[9,3,9,5],[8,3,8,5],[29,3,29,5],[17,3,17,5],[19,3,19,5],[20,3,20,5],[21,3,21,5],[23,3,23,5],[26,3,26,5],[28,3,28,5],[27,3,27,5],[25,3,25,5],[24,3,24,5],[22,3,22,5],[5,3,5,5],[30,3,30,5],[0,0,0,6],[3,3,3,5],[6,3,6,5],[4,3,4,5],[18,3,18,5],[16,3,16,5],[15,3,15,5],[2,3,2,5],[7,3,7,5],[12,3,12,5],[11,3,11,5],[10,3,10,5],[14,3,14,5],[13,3,13,5]]}
["GLOSSARY"]
[]
[null,"Consequence / Impact",null,"Outcome of an event affecting objectives."]
[null,"Enterprise Risk Management",null,"The consistent application of techniques to manage the uncertainties surrounding the achievement of an organization’s objectives. May include risks related to planning, investment management, public outreach, human resources, and other aspects of the organization that are not tied to a specific project or program of projects but still affects the achievement of strategic objectives."]
[null,"Likelihood / Probability",null,"A measure of how likely a condition or event is to occur.  It ranges from 0 to 100 percent (or 0.00 to 1.00)."]
[null,"Opportunity",null,"Uncertainty with a positive impact. A possible event that results in a benefit."]
[null,"Post-Treatment Risk Rating",null,"Also known as residual risk or retained risk, a quantitative or qualitative value based on the likelihood/probability of impact and the level of impact, after a risk response option is considered."]
[null,"Pre-Treatment Risk Rating",null,"A quantitative or qualitative value based on the probability of impact and the level of impact, with no risk response option considered."]
[null,"Program Risk Management",null,"The consistent application of techniques to manage the uncertainties surrounding a portfolio/suite of similar projects."]
[null,"Risk",null,"An uncertain event or condition that, if it occurs, has a negative or positive effect on an organization's, program's or project’s objectives."]
{"$rows_left_out":22}
{"sheet":"REF - FAQs","index":11,"n_rows":12,"n_cols":3,"rows_kept":12,"cut":false,"hidden":true,"merged":[[11,2,11,5],[10,2,10,4],[9,2,9,5],[8,2,8,4],[0,0,0,6],[2,2,2,4],[4,2,4,4],[6,2,6,4],[3,2,3,5],[5,2,5,5],[7,2,7,5]]}
["FREQUENTLY ASKED QUESTIONS"]
[]
[null,1,"How do you write a proper risk statement? "]
[null,null,"Each risk should have its own, unique risk statement. The statement should consist of a defined event and the impact resulting from the event. The statement should be concise but comprehensive. There are various formats to a risk statement but one of the more popular and recommended formats is the if/then format: \n\n“If <RISK EVENT> happens, then <CONSEQUENCE> will happen to <WHOM>, causing a/an <IMPACT> of <RESULT>.”\n\n"]
[null,2,"How does the impact and likelihood of a risk (the risk rating) influence how I should respond to that risk? "]
[null,null,"The risk rating is based on the impact and likelihood score, as defined by the user, and is the result of multiplying the two scores together. The rating is used to prioritize the risks, the higher the score, the greater the impact caused by the risk. This simple formula can help your agency rank the risks and focus on the risks that are either a) more likely to occur or b) will cause the most impact to the agency or program. Please refer to NCHRP 08-93: Managing Risk Across the Enterprise: A Guide for State Departments of Transportation for additional guidance on developing risk response strategies."]
[null,3,"How is the risk register integrated with my risk response strategies and actions? "]
[null,null,"Within the risk register, under the 'INPUT - Management' sheet, the user identifies an appropriate response action/strategy for each risk. This is an overarching response action/strategy and should serve as a starting point for a detailed risk response plan. For each risk, or for a group of risks, one should develop a risk response plan. The plan will provide further details on the risk(s), the response strategy and specific action steps that should be taken to address the risk(s). Further, the plan should identify who is responsible for each action step and when these steps should be addressed. "]
[null,4,"How do I determine my agency's risk categories, either at the enterprise or program-level? "]
[null,null,"Risk categories are specific to each agency and typically relate back to the agency's strategic goals (at the enterprise-level) or their program goals (at the program-level). As part of this NCHRP Project, the research team identified sample risk categories at the enterprise-level. These enterprise-level categories are identified in the Enterprise-level Example, on the Risk Rating Categories & Rating sheet. Further, the Program-level Example identifies common program-level risk categories for a typical asset management program. It is the responsibility of the agency to determine which risk categories it should use. If an agency is unsure of what categories to use, the agency should start with the risk categories in the Enterprise-level Example and expand on the categories, as needed. The final project report also contains illustrative listings of enterprise and program-level risk categories based on the research conducted to develop this tool."]
{"$rows_left_out":2}